Reaction Details
TargetORF1a
LigandBDBM154573
Substrate/Competitorn/a
Meas. Tech.Fluorimetric Assay
pH7.5±n/a
Ki 7.6e+3±n/a nM
IC50 6.2e+3± 9e+2 nM
Commentsextracted
Citation Lee, HLei, HSantarsiero, BDGatuz, JLCao, SRice, AJPatel, KSzypulinski, MZOjeda, IGhosh, AKJohnson, ME Inhibitor recognition specificity of MERS-CoV papain-like protease may differ from that of SARS-CoV. ACS Chem Biol10:1456-65 (2015) 
 
ORF1a
Name:ORF1a
Synonyms:MERS-CoV papain-like protease (MERS-PLpro)
Type:Protein
Mol. Mass.:485961.61
Organism:Middle East respiratory syndrome coronavirus (Virus)
Description:K4LC41
Residue:4391
BDBM154573
NameBDBM154573
TypeSmall organic molecule
Emp. Form.C6H4F3N5
Mol. Mass.203.1247
SMILESNc1ncnc2[nH]c(nc12)C(F)(F)F