Reaction Details
TargetORF1a
LigandBDBM154575
Substrate/Competitorn/a
Meas. Tech.Surface Plasmon Resonance
pH7.4±n/a
Kd 3.99e+4±n/a nM
Commentsextracted
Citation Lee, HLei, HSantarsiero, BDGatuz, JLCao, SRice, AJPatel, KSzypulinski, MZOjeda, IGhosh, AKJohnson, ME Inhibitor recognition specificity of MERS-CoV papain-like protease may differ from that of SARS-CoV. ACS Chem Biol10:1456-65 (2015) 
 
ORF1a
Name:ORF1a
Synonyms:MERS-CoV papain-like protease (MERS-PLpro)
Type:Protein
Mol. Mass.:485961.61
Organism:Middle East respiratory syndrome coronavirus (Virus)
Description:K4LC41
Residue:4391
BDBM154575
NameBDBM154575
Synonyms:3-chloro-N-[5-(7-ethoxy-1-benzofuran-2-yl)-1,3,4-oxadiazol-2-yl]-1-benzothiophene-2-carboxamide (3)
TypeSmall organic molecule
Emp. Form.C21H14ClN3O4S
Mol. Mass.439.872
SMILESCCOc1cccc2cc(oc12)-c1nnc(NC(=O)c2sc3ccccc3c2Cl)o1