Reaction Details
TargetMitogen-activated protein kinase 1
LigandBDBM154615
Substrate/Competitorn/a
Meas. Tech.IMAP-FP Assay
IC50 3.4±n/a nM
Citation Deng, YZhu, LShipps, Jr., GWLo, SSun, BHuang, XBienstock, CCooper, ABGao, XYao, XZhu, HYKelly, JMBoga, SBAlhassan, ATagat, JRMansoor, UFWilson, KJO'Boyle, BMDaniels, MHSchell, ASiliphaivanh, PFischer, C Heterocyclic compounds as ERK inhibitors US Patent US8999957 Publication Date 4/7/2015
 
Mitogen-activated protein kinase 1
Name:Mitogen-activated protein kinase 1
Type:Protein
Mol. Mass.:41278.65
Organism:Mus musculus (Mouse)
Description:P63085
Residue:358
BDBM154615
NameBDBM154615
Synonyms:US8999957, Column 165-167, Compound 4
TypeSmall organic molecule
Emp. Form.C31H33FN6O3
Mol. Mass.556.6305
SMILESCOc1cccc(F)c1CN1C[C@@H](CC[C@H]1C(=O)NC1CC1)NC(=O)c1ccc2[nH]nc(-c3ccnc(C)c3)c2c1