Reaction Details
TargetMitogen-activated protein kinase 1
LigandBDBM154617
Substrate/Competitorn/a
Meas. Tech.IMAP-FP Assay
IC50 1.5±n/a nM
Citation Deng, YZhu, LShipps, Jr., GWLo, SSun, BHuang, XBienstock, CCooper, ABGao, XYao, XZhu, HYKelly, JMBoga, SBAlhassan, ATagat, JRMansoor, UFWilson, KJO'Boyle, BMDaniels, MHSchell, ASiliphaivanh, PFischer, C Heterocyclic compounds as ERK inhibitors US Patent US8999957 Publication Date 4/7/2015
 
Mitogen-activated protein kinase 1
Name:Mitogen-activated protein kinase 1
Type:Protein
Mol. Mass.:41278.65
Organism:Mus musculus (Mouse)
Description:P63085
Residue:358
BDBM154617
NameBDBM154617
Synonyms:US8999957, Column 165-167, Compound 6
TypeSmall organic molecule
Emp. Form.C34H39FN6O4
Mol. Mass.614.7097
SMILESCOc1cccc(F)c1CN1C[C@@H](CC[C@H]1C(=O)NC[C@@H]1CC[C@@H](O)C1)NC(=O)c1ccc2[nH]nc(-c3ccnc(C)c3)c2c1