Reaction Details
TargetMitogen-activated protein kinase 1
LigandBDBM154619
Substrate/Competitorn/a
Meas. Tech.IMAP-FP Assay
IC50 4.9±n/a nM
Citation Deng, YZhu, LShipps, Jr., GWLo, SSun, BHuang, XBienstock, CCooper, ABGao, XYao, XZhu, HYKelly, JMBoga, SBAlhassan, ATagat, JRMansoor, UFWilson, KJO'Boyle, BMDaniels, MHSchell, ASiliphaivanh, PFischer, C Heterocyclic compounds as ERK inhibitors US Patent US8999957 Publication Date 4/7/2015
 
Mitogen-activated protein kinase 1
Name:Mitogen-activated protein kinase 1
Type:Protein
Mol. Mass.:41278.65
Organism:Mus musculus (Mouse)
Description:P63085
Residue:358
BDBM154619
NameBDBM154619
Synonyms:US8999957, Column 165-167, Compound 8
TypeSmall organic molecule
Emp. Form.C32H35FN6O3
Mol. Mass.570.6571
SMILESCOc1cccc(F)c1CN1C[C@@H](CC[C@H]1C(=O)NCC1CC1)NC(=O)c1ccc2[nH]nc(-c3ccnc(C)c3)c2c1