Reaction Details
TargetMitogen-activated protein kinase 1
LigandBDBM154600
Substrate/Competitorn/a
Meas. Tech.IMAP Assay
IC50 5.5±n/a nM
Citation Deng, YZhu, LShipps, Jr., GWLo, SSun, BHuang, XBienstock, CCooper, ABGao, XYao, XZhu, HYKelly, JMBoga, SBAlhassan, ATagat, JRMansoor, UFWilson, KJO'Boyle, BMDaniels, MHSchell, ASiliphaivanh, PFischer, C Heterocyclic compounds as ERK inhibitors US Patent US8999957 Publication Date 4/7/2015
 
Mitogen-activated protein kinase 1
Name:Mitogen-activated protein kinase 1
Type:Protein
Mol. Mass.:41278.65
Organism:Mus musculus (Mouse)
Description:P63085
Residue:358
BDBM154600
NameBDBM154600
Synonyms:US8999957, Column 153, Compound 5 | US8999957, Table 1, Compound 7
TypeSmall organic molecule
Emp. Form.C25H24FN5O
Mol. Mass.429.4894
SMILESFc1ccccc1CN1CCC[C@H](C1)NC(=O)c1ccc2[nH]nc(-c3ccncc3)c2c1