Reaction Details
TargetMitogen-activated protein kinase 1
LigandBDBM154898
Substrate/Competitorn/a
Meas. Tech.IMAP Assay
IC50 3.09±n/a nM
Citation Deng, YZhu, LShipps, Jr., GWLo, SSun, BHuang, XBienstock, CCooper, ABGao, XYao, XZhu, HYKelly, JMBoga, SBAlhassan, ATagat, JRMansoor, UFWilson, KJO'Boyle, BMDaniels, MHSchell, ASiliphaivanh, PFischer, C Heterocyclic compounds as ERK inhibitors US Patent US8999957 Publication Date 4/7/2015
 
Mitogen-activated protein kinase 1
Name:Mitogen-activated protein kinase 1
Type:Protein
Mol. Mass.:41278.65
Organism:Mus musculus (Mouse)
Description:P63085
Residue:358
BDBM154898
NameBDBM154898
Synonyms:US8999957, Table 4, Compound 3
TypeSmall organic molecule
Emp. Form.C30H30F2N6O
Mol. Mass.528.5956
SMILESCCN1CC(Cc2c(F)cccc2F)CC(C1)NC(=O)c1ccc2[nH]nc(-c3ccc4nn(C)cc4c3)c2c1