Reaction Details
TargetMitogen-activated protein kinase 1
LigandBDBM154904
Substrate/Competitorn/a
Meas. Tech.IMAP Assay
IC50 3.83±n/a nM
Citation Deng, YZhu, LShipps, Jr., GWLo, SSun, BHuang, XBienstock, CCooper, ABGao, XYao, XZhu, HYKelly, JMBoga, SBAlhassan, ATagat, JRMansoor, UFWilson, KJO'Boyle, BMDaniels, MHSchell, ASiliphaivanh, PFischer, C Heterocyclic compounds as ERK inhibitors US Patent US8999957 Publication Date 4/7/2015
 
Mitogen-activated protein kinase 1
Name:Mitogen-activated protein kinase 1
Type:Protein
Mol. Mass.:41278.65
Organism:Mus musculus (Mouse)
Description:P63085
Residue:358
BDBM154904
NameBDBM154904
Synonyms:US8999957, Table 4, Compound 9
TypeSmall organic molecule
Emp. Form.C27H25F2N7O
Mol. Mass.501.5305
SMILESCN1CC(Cc2c(F)cccc2F)CC(C1)NC(=O)c1ccc2[nH]nc(-c3ccn4ncnc4c3)c2c1