Reaction Details
TargetMitogen-activated protein kinase 1
LigandBDBM154908
Substrate/Competitorn/a
Meas. Tech.IMAP Assay
IC50 2.715±n/a nM
Citation Deng, YZhu, LShipps, Jr., GWLo, SSun, BHuang, XBienstock, CCooper, ABGao, XYao, XZhu, HYKelly, JMBoga, SBAlhassan, ATagat, JRMansoor, UFWilson, KJO'Boyle, BMDaniels, MHSchell, ASiliphaivanh, PFischer, C Heterocyclic compounds as ERK inhibitors US Patent US8999957 Publication Date 4/7/2015
 
Mitogen-activated protein kinase 1
Name:Mitogen-activated protein kinase 1
Type:Protein
Mol. Mass.:41278.65
Organism:Mus musculus (Mouse)
Description:P63085
Residue:358
BDBM154908
NameBDBM154908
Synonyms:US8999957, Table 4, Compound 13
TypeSmall organic molecule
Emp. Form.C28H25F2N5OS
Mol. Mass.517.593
SMILESCN1CC(Cc2c(F)cccc2F)CC(C1)NC(=O)c1ccc2[nH]nc(-c3ccc4ncsc4c3)c2c1