Reaction Details
TargetOxysterols receptor LXR-beta
LigandBDBM155256
Substrate/Competitorn/a
Meas. Tech.Radioligand Binding Assay
Ki 256±n/a nM
Citation Dong, CFan, YLeftheris, KLotesta, SDSingh, SBTice, CMZhao, WZheng, YZhuang, L Liver X receptor modulators US Patent US9006244 Publication Date 4/14/2015
 
Oxysterols receptor LXR-beta
Name:Oxysterols receptor LXR-beta
Type:Enzyme Catalytic Domain
Mol. Mass.:50978.79
Organism:Homo sapiens (Human)
Description:P55055
Residue:460
BDBM155256
NameBDBM155256
Synonyms:US9006244, E1
TypeSmall organic molecule
Emp. Form.C19H20F3N5O2S
Mol. Mass.439.455
SMILESCC(C)C1N(CCn2c1nc1ccc(cc21)S(C)(=O)=O)c1nccc(n1)C(F)(F)F