Reaction Details
TargetOxysterols receptor LXR-beta
LigandBDBM155260
Substrate/Competitorn/a
Meas. Tech.Radioligand Binding Assay
Ki 1750±n/a nM
Citation Dong, CFan, YLeftheris, KLotesta, SDSingh, SBTice, CMZhao, WZheng, YZhuang, L Liver X receptor modulators US Patent US9006244 Publication Date 4/14/2015
 
Oxysterols receptor LXR-beta
Name:Oxysterols receptor LXR-beta
Type:Enzyme Catalytic Domain
Mol. Mass.:50978.79
Organism:Homo sapiens (Human)
Description:P55055
Residue:460
BDBM155260
NameBDBM155260
Synonyms:US9006244, E3b | US9814715, Example 3, isomer 2
TypeSmall organic molecule
Emp. Form.C20H21F3N4O2S
Mol. Mass.438.467
SMILESCC(C)[C@@H]1N(CCn2c1cc1ccc(cc21)S(C)(=O)=O)c1nccc(n1)C(F)(F)F