Reaction Details
TargetNeprilysin
LigandBDBM155344
Substrate/Competitorn/a
Meas. Tech.Fluorescence Lifetime-Based Assay
pH7.4±n/a
Temperature298.15±n/a K
IC50 0.3±n/a nM
Commentsextracted
Citation Coppola, GMIwaki, YKarki, RGKawanami, TKsander, GMMogi, MSun, R Substituted aminobutyric derivatives as neprilysin inhibitors US Patent US9006249 Publication Date 4/14/2015
 
Neprilysin
Name:Neprilysin
Type:Enzyme
Mol. Mass.:85505.38
Organism:Homo sapiens (Human)
Description:P08473
Residue:750
BDBM155344
NameBDBM155344
Synonyms:US9006249, Example 49-3 | US9603819, Example 49-3
TypeSmall organic molecule
Emp. Form.C24H22ClNO6
Mol. Mass.455.888
SMILESC[C@H](C[C@@H](Cc1ccc(cc1)-c1cccc(Cl)c1)NC(=O)c1ccc(o1)C(O)=O)C(O)=O