Reaction Details
TargetSteroid 17-alpha-hydroxylase/17,20 lyase
LigandBDBM158474
Substrate/Competitorn/a
Meas. Tech.Inhibition Assay
pH7.5±n/a
IC50 1.9±n/a nM
Commentsextracted
Citation Bock, MGGaul, CGummadi, VRSengupta, S 17α-hydroxylase/C17,20-lyase inhibitors US Patent US9029399 Publication Date 5/12/2015
 
Steroid 17-alpha-hydroxylase/17,20 lyase
Name:Steroid 17-alpha-hydroxylase/17,20 lyase
Type:Enzyme
Mol. Mass.:57382.42
Organism:Homo sapiens (Human)
Description:E.coli expressing human CYP17
Residue:508
BDBM158474
NameBDBM158474
Synonyms:US9029399, 46A | US9339501, 46A
TypeSmall organic molecule
Emp. Form.C16H14Cl2N4O
Mol. Mass.349.215
SMILESClc1cc(cc(Cl)n1)N1CCN(C1=O)c1cnccc1C1CC1