Reaction Details
TargetSteroid 17-alpha-hydroxylase/17,20 lyase
LigandBDBM158429
Substrate/Competitorn/a
Meas. Tech.Inhibition Assay
pH7.5±n/a
IC50 1.1±n/a nM
Commentsextracted
Citation Bock, MGGaul, CGummadi, VRSengupta, S 17α-hydroxylase/C17,20-lyase inhibitors US Patent US9029399 Publication Date 5/12/2015
 
Steroid 17-alpha-hydroxylase/17,20 lyase
Name:Steroid 17-alpha-hydroxylase/17,20 lyase
Type:Enzyme
Mol. Mass.:57255.68
Organism:Rattus norvegicus (Rat)
Description:P11715
Residue:507
BDBM158429
NameBDBM158429
Synonyms:US9029399, 2A | US9339501, 2A
TypeSmall organic molecule
Emp. Form.C17H15F3N4O
Mol. Mass.348.3224
SMILESFC(F)(F)c1cc(ccn1)N1CCN(C1=O)c1cnccc1C1CC1