Reaction Details
TargetATP-sensitive inward rectifier potassium channel 1
LigandBDBM162876
Substrate/Competitorn/a
Meas. Tech.Electrophysiology Assay
pH7.4±n/a
IC50 56±n/a nM
Commentsextracted
Citation Pasternak, AdeJesus, RKZhu, YYang, LWalsh, STang, HKim, DPio, BShahripour, ABelyk, K Inhibitors of the renal outer medullary potassium channel US Patent US9056859 Publication Date 6/16/2015
 
ATP-sensitive inward rectifier potassium channel 1
Name:ATP-sensitive inward rectifier potassium channel 1
Type:Enzyme
Mol. Mass.:44976.27
Organism:Rattus norvegicus (Rat)
Description:P35560
Residue:391
BDBM162876
NameBDBM162876
Synonyms:US9056859, 217
TypeSmall organic molecule
Emp. Form.C24H25N7O4
Mol. Mass.475.4998
SMILESCc1c2COC(=O)c2ccc1[C@@H](O)CN1CCN(C2CC12)C(=O)Cc1ccc(nc1)-n1cnnn1