Reaction Details
TargetHistone deacetylase 2/Nuclear receptor corepressor 2 [395-498]
LigandBDBM163624
Substrate/Competitorn/a
Meas. Tech.HDAC Activity Assays
IC50 8.8e+2±n/a nM
Citation Wang, YStowe, RLPinello, CETian, GMadoux, FLi, DZhao, LYLi, JLWang, YWang, YMa, HHodder, PRoush, WRLiao, D Identification of histone deacetylase inhibitors with benzoylhydrazide scaffold that selectively inhibit class I histone deacetylases. Chem Biol22:273-84 (2015) 
 
Histone deacetylase 2/Nuclear receptor corepressor 2 [395-498]
Name:Histone deacetylase 2/Nuclear receptor corepressor 2 [395-498]
Synonyms:HDAC2/NCOR2
Type:Protein
Mol. Mass.:n/a
Description:BPS Bioscience
Components:This complex has 2 components.
Component 1
Name:Histone deacetylase 2
Type:Chromatin regulator; hydrolase; repressor
Mol. Mass.:55356.54
Organism:Homo sapiens (Human)
Description:Q92769
Residue:488
Component 2
Name:Nuclear receptor corepressor 2 [395-498]
Synonyms:CTG26 NCOR2 Nuclear receptor corepressor 2
Type:Protein
Mol. Mass.:12719.17
Organism:Homo sapiens (Human)
Description:Deacetylase activation domain of human NCOR2 (395-498aa)
Residue:104
BDBM163624
NameBDBM163624
Synonyms:SR-3208 US11731934, Compound RLS2-131
TypeSmall organic molecule
Emp. Form.C13H21N3O
Mol. Mass.235.3253
SMILESCCCCNNC(=O)c1ccc(cc1)N(C)C