Reaction Details
TargetSignal transducer and activator of transcription 5A
LigandBDBM165191
Substrate/Competitorn/a
Meas. Tech.Fluorescence Polarization Assay
Ki 4.9e+4±4e+3 nM
IC50 98000±90000 nM
Citation Elumalai, NBerg, ARubner, SBerg, T Phosphorylation of Capsaicinoid Derivatives Provides Highly Potent and Selective Inhibitors of the Transcription Factor STAT5b. ACS Chem Biol10:2884-90 (2015) 
 
Signal transducer and activator of transcription 5A
Name:Signal transducer and activator of transcription 5A
Type:Protein
Mol. Mass.:90643.89
Organism:Homo sapiens (Human)
Description:n/a
Residue:794
BDBM165191
NameBDBM165191
Synonyms:2-Methoxy-4-(nonanamidomethyl)phenyl dihydrogen phosphate (3b)
Typen/a
Emp. Form.C17H28NO6P
Mol. Mass.373.3811
SMILESCCCCCCCCC(=O)NCc1ccc(OP(O)(O)=O)c(OC)c1