Reaction Details
TargetSignal transducer and activator of transcription 5A
LigandBDBM165192
Substrate/Competitorn/a
Meas. Tech.Fluorescence Polarization Assay
Ki 1.3e+4±7e+2 nM
IC50 26400±1400 nM
Citation Elumalai, NBerg, ARubner, SBerg, T Phosphorylation of Capsaicinoid Derivatives Provides Highly Potent and Selective Inhibitors of the Transcription Factor STAT5b. ACS Chem Biol10:2884-90 (2015) 
 
Signal transducer and activator of transcription 5A
Name:Signal transducer and activator of transcription 5A
Type:Protein
Mol. Mass.:90643.89
Organism:Homo sapiens (Human)
Description:n/a
Residue:794
BDBM165192
NameBDBM165192
Synonyms:4-((8-Methylnonanamido)methyl)-1,2-phenylene bis(dihydrogen phosphate) (6a)
Typen/a
Emp. Form.C17H29NO9P2
Mol. Mass.453.361
SMILESCC(C)CCCCCCC(=O)NCc1ccc(OP(O)(O)=O)c(OP(O)(O)=O)c1