Reaction Details
TargetCasein kinase II subunit alpha
LigandBDBM165399
Substrate/Competitorn/a
Meas. Tech.In Vitro Cell-Free Assay
pH7.2±n/a
IC50 7±n/a nM
Commentsextracted
Citation Chua, PCPierre, FWhitten, JP Fused tricyclic compounds as serine-threonine protein kinase and PARP modulators US Patent US9062043 Publication Date 6/23/2015
 
Casein kinase II subunit alpha
Name:Casein kinase II subunit alpha
Type:Enzyme
Mol. Mass.:45151.12
Organism:Homo sapiens (Human)
Description:P68400
Residue:391
BDBM165399
NameBDBM165399
Synonyms:US8168651, Compound TABLE 16.67 US9062043, Table 20b, Compound 31
TypeSmall organic molecule
Emp. Form.C18H11ClFN5O2
Mol. Mass.383.764
SMILESNc1ncc2c3ccc(cc3nc(Nc3ccc(F)c(Cl)c3)c2n1)C(O)=O