Reaction Details
TargetDipeptidyl peptidase 4 [K6R,T557I]
LigandBDBM167933
Substrate/Competitorn/a
Meas. Tech.DPP-IV Inhibition Activity
Temperature298.15±n/a K
IC50 112±0.0 nM
Commentsextracted
Citation Gomha, SMEldebss, TMBadrey, MGAbdulla, MMMayhoub, AS Novel 4-heteroaryl-antipyrines as DPP-IV inhibitors. Chem Biol Drug Des86:1292-303 (2015) 
 
Dipeptidyl peptidase 4 [K6R,T557I]
Name:Dipeptidyl peptidase 4 [K6R,T557I]
Type:Protein
Mol. Mass.:88325.11
Organism:Homo sapiens (Human)
Description:P27487[K6R,T557I]
Residue:766
BDBM167933
NameBDBM167933
Synonyms:7-(1,5-Dimethyl-3-oxo-2-phenyl-2,3-dihydro-1H-pyrazol-4-yl)-6-(phenylsulfonyl)pyrazolo[1,5-a]pyrimidine-3-carbonitrile (11)
TypeSmall organic molecule
Emp. Form.C24H18N6O3S
Mol. Mass.470.503
SMILESCc1c(-c2c(cnc3c(cnn23)C#N)S(=O)(=O)c2ccccc2)c(=O)n(-c2ccccc2)n1C