Reaction Details
TargetDipeptidyl peptidase 4 [K6R,T557I]
LigandBDBM167936
Substrate/Competitorn/a
Meas. Tech.DPP-IV Inhibition Activity
Temperature298.15±n/a K
IC50 73±0.0 nM
Commentsextracted
Citation Gomha, SMEldebss, TMBadrey, MGAbdulla, MMMayhoub, AS Novel 4-heteroaryl-antipyrines as DPP-IV inhibitors. Chem Biol Drug Des86:1292-303 (2015) 
 
Dipeptidyl peptidase 4 [K6R,T557I]
Name:Dipeptidyl peptidase 4 [K6R,T557I]
Type:Protein
Mol. Mass.:88325.11
Organism:Homo sapiens (Human)
Description:P27487[K6R,T557I]
Residue:766
BDBM167936
NameBDBM167936
Synonyms:1,5-Dimethyl-2-phenyl-4-(3-(phenylsulfonyl)benzo[4,5]imidazo[1,2-a]pyrimidin-4-yl)-1H-pyrazol-3(2H)-one (14)
TypeSmall organic molecule
Emp. Form.C27H21N5O3S
Mol. Mass.495.552
SMILESCc1c(-c2c(cnc3nc4ccccc4n23)S(=O)(=O)c2ccccc2)c(=O)n(-c2ccccc2)n1C