Reaction Details
TargetDipeptidyl peptidase 4 [K6R,T557I]
LigandBDBM167943
Substrate/Competitorn/a
Meas. Tech.DPP-IV Inhibition Activity
Temperature298.15±n/a K
IC50>50±0.0 nM
Commentsextracted
Citation Gomha, SMEldebss, TMBadrey, MGAbdulla, MMMayhoub, AS Novel 4-heteroaryl-antipyrines as DPP-IV inhibitors. Chem Biol Drug Des86:1292-303 (2015) 
 
Dipeptidyl peptidase 4 [K6R,T557I]
Name:Dipeptidyl peptidase 4 [K6R,T557I]
Type:Protein
Mol. Mass.:88325.11
Organism:Homo sapiens (Human)
Description:P27487[K6R,T557I]
Residue:766
BDBM167943
NameBDBM167943
Synonyms:3-(1,5-Dimethyl-3-oxo-2-phenyl-2,3-dihydro-1Hpyrazol-4-yl)-2-(phenylsulfonyl)benzo[4,5]imidazo[1,2-a]pyridine-4-carbonitrile (26)
TypeSmall organic molecule
Emp. Form.C29H21N5O3S
Mol. Mass.519.574
SMILESCc1c(-c2c(C#N)c3nc4ccccc4n3cc2S(=O)(=O)c2ccccc2)c(=O)n(-c2ccccc2)n1C