Reaction Details
TargetPotassium voltage-gated channel subfamily H member 2
LigandBDBM168618
Substrate/Competitorn/a
Meas. Tech.In Vitro Binding Assay
Ki 553±n/a nM
Citation Liotta, DCSnyder, JPTraynelis, SFWilson, LMosley, CDingledine, RJMyers, STahirovic, YA NMDA receptor antagonists for neuroprotection US Patent US9079852 Publication Date 7/14/2015
 
Potassium voltage-gated channel subfamily H member 2
Name:Potassium voltage-gated channel subfamily H member 2
Type:Multi-pass membrane protein
Mol. Mass.:126672.65
Organism:Homo sapiens (Human)
Description:Q12809
Residue:1159
BDBM168618
NameBDBM168618
Synonyms:US9079852, Table F, Compound 3
TypeSmall organic molecule
Emp. Form.C20H26ClN3O4S
Mol. Mass.439.956
SMILESCS(=O)(=O)Nc1ccc(OC[C@@H](O)CN2CCN(CC2)c2ccc(Cl)cc2)cc1