Reaction Details
TargetPotassium voltage-gated channel subfamily H member 2
LigandBDBM168621
Substrate/Competitorn/a
Meas. Tech.In Vitro Binding Assay
Ki 7500±n/a nM
Citation Liotta, DCSnyder, JPTraynelis, SFWilson, LMosley, CDingledine, RJMyers, STahirovic, YA NMDA receptor antagonists for neuroprotection US Patent US9079852 Publication Date 7/14/2015
 
Potassium voltage-gated channel subfamily H member 2
Name:Potassium voltage-gated channel subfamily H member 2
Type:Multi-pass membrane protein
Mol. Mass.:126672.65
Organism:Homo sapiens (Human)
Description:Q12809
Residue:1159
BDBM168621
NameBDBM168621
Synonyms:US9079852, Table F, Compound 6
TypeSmall organic molecule
Emp. Form.C22H24ClN3O3
Mol. Mass.413.897
SMILESO[C@H](COc1ccc2[nH]c(=O)ccc2c1)CN1CCN(CC1)c1ccc(Cl)cc1