Reaction Details
TargetOpioid growth factor receptor-like protein 1
LigandBDBM172438
Substrate/Competitorn/a
Meas. Tech.Radioligand Binding Assay
pH7.4±n/a
Temperature298.15±n/a K
Ki 3.8±0.7 nM
Commentsextracted
Citation Yamawaki, KYao, JYu, JZhou, X Substituted benzimidazole-type piperidine compounds and uses thereof US Patent US9090618 Publication Date 7/28/2015
 
Opioid growth factor receptor-like protein 1
Name:Opioid growth factor receptor-like protein 1
Type:Protein
Mol. Mass.:51247.53
Organism:Homo sapiens (Human)
Description:Q5TC84
Residue:451
BDBM172438
NameBDBM172438
Synonyms:US9090618, ZA61 | US9598411, Ref. No. ZA61
TypeSmall organic molecule
Emp. Form.C29H40N6
Mol. Mass.472.6681
SMILESCc1nnc(Cc2nc3ccccc3n2[C@@H]2C[C@@H]3CCC[C@H](C2)N3[C@H]2C[C@@H]3C[C@H](C2)CCCC3)[nH]1