Reaction Details
TargetCyclin-dependent kinase 5
LigandBDBM173196
Substrate/Competitorn/a
Meas. Tech.HTS Assay
Temperature298.15±n/a K
IC50 1400±n/a nM
Commentsextracted
Citation Wagner, FFPan, JQDandapani, SGermain, AHolson, EMunoz, BNag, PPWeiwer, MLewis, MCHaggarty, SJBishop, JAStegmaier, KBanerji, V Kinase inhibitors and methods of use thereof US Patent US9096594 Publication Date 8/4/2015
 
Cyclin-dependent kinase 5
Name:Cyclin-dependent kinase 5
Type:Enzyme Subunit
Mol. Mass.:33308.61
Organism:Homo sapiens (Human)
Description:n/a
Residue:292
BDBM173196
NameBDBM173196
Synonyms:4-(2-methoxyphenyl)-3,7,7-trimethyl-2,4,6,7,8,9-hexahydro-5H-pyrazolo[3,4-b]quinolin-5-one (12) US9096594, 22
TypeSmall organic molecule
Emp. Form.C20H23N3O2
Mol. Mass.337.4155
SMILESCOc1ccccc1C1c2c(C)[nH]nc2NC2=C1C(=O)CC(C)(C)C2