Reaction Details
TargetAcetylcholinesterase
LigandBDBM11023
Substrate/Competitorn/a
Meas. Tech.AChE and BChE Assay
pH7.7±n/a
IC50 4e+1± 0.1 nM
Commentsextracted
Citation Riaz, SKhan, IUBajda, MAshraf, MQurat-Ul-Ain, nullShaukat, ARehman, TUMutahir, SHussain, SMustafa, GYar, M Pyridine sulfonamide as a small key organic molecule for the potential treatment of type-II diabetes mellitus and Alzheimer's disease: In vitro studies against yeast a-glucosidase, acetylcholinesterase and butyrylcholinesterase. Bioorg Chem63:64-71 (2015) 
 
Acetylcholinesterase
Name:Acetylcholinesterase
Type:Enzyme
Mol. Mass.:71812.79
Organism:Electrophorus electricus (Electric eel)
Description:n/a
Residue:633
BDBM11023
NameBDBM11023
Synonyms:(3aS,8aR)-1,3a,8-trimethyl-1H,2H,3H,3aH,8H,8aH-pyrrolo[2,3-b]indol-5-yl N-methylcarbamate; 2-hydroxybenzoic acid cid_657348 | physostigmine.salicylic acid
TypeSmall Organic Molecule
Emp. Form.C15H21N3O2
Mol. Mass.275.3461
SMILES[H][C@]12N(C)CC[C@@]1(C)c1cc(OC(=O)NC)ccc1N2C