Reaction Details
TargetNeuraminidase
LigandBDBM5266
Substrate/CompetitorBDBM4702
Meas. Tech.Neuraminidase Inhibition Assay
pH6.5±n/a
Temperature310.15±n/a K
IC50 1±n/a nM
Citation Atigadda, VRBrouillette, WJDuarte, FBabu, YSBantia, SChand, PChu, NMontgomery, JAWalsh, DASudbeck, EFinley, JAir, GMLuo, MLaver, GW Hydrophobic benzoic acids as inhibitors of influenza neuraminidase. Bioorg Med Chem7:2487-97 (1999) 
 
Neuraminidase
Name:Neuraminidase
Type:Enzyme
Mol. Mass.:52000.86
Organism:Influenza A virus (A/Singapore/1/57(H2N2))
Description:Q6XUE4
Residue:469
BDBM5266
BDBM4702
NameBDBM5266
Synonyms:(2S,3S,4R)-4-carbamimidamido-2-(dipropylcarbamoyl)-3-acetamido-3,4-dihydro-2H-pyran-6-carboxylic acid | Benzoic Acid Inhibitor 4a
TypeSmall organic molecule
Emp. Form.C16H27N5O5
Mol. Mass.369.4161
SMILES[#6]-[#6]-[#6]-[#7](-[#6]-[#6]-[#6])-[#6](=O)-[#6@H]-1-[#8]-[#6](=[#6]-[#6@@H](\[#7]=[#6](/[#7])-[#7])-[#6@@H]-1-[#7]-[#6](-[#6])=O)-[#6](-[#8])=O