Reaction Details
TargetTransient receptor potential cation channel subfamily V member 1
LigandBDBM176561
Substrate/Competitorn/a
Meas. Tech.FLIPR Assay
Temperature310.15±n/a K
Ki 0.3±n/a nM
Commentsextracted
Citation Frank, RBahrenberg, GChristoph, TSchiene, KDe Vry, JDamann, NFrormann, SLesch, BLee, JKim, YKim, MSaunders, DStockhausen, H Substituted phenylureas and phenylamides as vanilloid receptor ligands US Patent US9120756 Publication Date 9/1/2015
 
Transient receptor potential cation channel subfamily V member 1
Name:Transient receptor potential cation channel subfamily V member 1
Type:Protein
Mol. Mass.:94960.75
Organism:Homo sapiens (Human)
Description:Q8NER1
Residue:839
BDBM176561
NameBDBM176561
Synonyms:US9120756, 23
TypeSmall organic molecule
Emp. Form.C21H19ClF4N4O3S
Mol. Mass.518.912
SMILESC[C@H](C(=O)NCc1cc(nn1-c1ccc(Cl)cc1)C(F)(F)F)c1ccc(NS(C)(=O)=O)c(F)c1