Reaction Details
TargetProtein O-GlcNAcase
LigandBDBM177755
Substrate/Competitorn/a
Meas. Tech.Enzyme Assay
pH7±n/a
Temperature298.15±n/a K
Ki 0.13±n/a nM
Commentsextracted
Citation Li, TMceachern, EJVocadlo, DJZhou, YZhu, YLiu, KSelnick, HG Selective glycosidase inhibitors and uses thereof US Patent US9120781 Publication Date 9/1/2015
 
Protein O-GlcNAcase
Name:Protein O-GlcNAcase
Type:Enzyme
Mol. Mass.:102874.67
Organism:Homo sapiens (Human)
Description:O60502
Residue:916
BDBM177755
NameBDBM177755
Synonyms:US9120781, 18
TypeSmall organic molecule
Emp. Form.C11H18N2O4
Mol. Mass.242.2716
SMILESOC[C@H]1C[C@@H]2OC(=N[C@@H]2[C@@H](O)[C@@H]1O)N1CCC1