Reaction Details
TargetApoptosis regulator Bcl-2
LigandBDBM177795
Substrate/Competitorn/a
Meas. Tech.Fluorescence Polarisation Assay
pH7.4±n/a
IC50 12±n/a nM
Commentsextracted
Citation Le Diguarher, TCasara, PStarck, JHenlin, JDavidson, JEMurray, JBGraham, CJChen, IGeneste, OHickman, JDepil, SLe Tiran, ANyerges, MDe Nanteuil, G Indolizine compounds, a process for their preparation and pharmaceutical compositions containing them US Patent US9120791 Publication Date 9/1/2015
 
Apoptosis regulator Bcl-2
Name:Apoptosis regulator Bcl-2
Type:Protein
Mol. Mass.:26409.44
Organism:Mus musculus (Mouse)
Description:P10417
Residue:236
BDBM177795
NameBDBM177795
Synonyms:US9120791, Example 13
TypeSmall organic molecule
Emp. Form.C47H48N6O5
Mol. Mass.776.9212
SMILESCN1CCN(C[C@@H]2Cc3ccccc3CN2C(=O)c2cc3OCOc3cc2-c2cc(C(=O)N(c3ccc(O)cc3)c3ccc4n(C)ccc4c3)c3CCCCn23)CC1