Reaction Details
TargetApoptosis regulator Bcl-2
LigandBDBM177798
Substrate/Competitorn/a
Meas. Tech.Fluorescence Polarisation Assay
pH7.4±n/a
IC50 18±n/a nM
Commentsextracted
Citation Le Diguarher, TCasara, PStarck, JHenlin, JDavidson, JEMurray, JBGraham, CJChen, IGeneste, OHickman, JDepil, SLe Tiran, ANyerges, MDe Nanteuil, G Indolizine compounds, a process for their preparation and pharmaceutical compositions containing them US Patent US9120791 Publication Date 9/1/2015
 
Apoptosis regulator Bcl-2
Name:Apoptosis regulator Bcl-2
Type:Protein
Mol. Mass.:26409.44
Organism:Mus musculus (Mouse)
Description:P10417
Residue:236
BDBM177798
NameBDBM177798
Synonyms:US9120791, Example 16 | US9603854, 16
TypeSmall organic molecule
Emp. Form.C47H47N5O6
Mol. Mass.777.906
SMILESC[C@H]1COCCN1C[C@@H]1Cc2ccccc2CN1C(=O)c1cc2OCOc2cc1-c1cc(C(=O)N(c2ccc(O)cc2)c2ccc3n(C)ccc3c2)c2CCCCn12