Reaction Details
TargetMu-type opioid receptor
LigandBDBM177947
Substrate/Competitorn/a
Meas. Tech.Binding Assay
Temperature298.15±n/a K
Ki 1.1±n/a nM
Commentsextracted
Citation Hinze, CAulenbacher, OSundermann, BOberboersch, SFriderichs, EEnglberger, WKoegel, BLinz, KSchick, HSonnenschein, HHenkel, BRose, VSLipkin, MJ Process for preparing spirocyclic cyclohexane compounds, compositions containing such compounds and method of using such compounds US Patent US9120797 Publication Date 9/1/2015
 
Mu-type opioid receptor
Name:Mu-type opioid receptor
Type:G Protein-Coupled Receptor (GPCR)
Mol. Mass.:44789.51
Organism:Homo sapiens (Human)
Description:P35372
Residue:400
BDBM177947
NameBDBM177947
Synonyms:US9120797, 45
TypeSmall organic molecule
Emp. Form.C24H28N2O2
Mol. Mass.376.4913
SMILESCN(C)C1(CCC2(CC1)OCCc1c2[nH]c2ccc(O)cc12)c1ccccc1