Reaction Details
TargetHistone deacetylase 3
LigandBDBM178100
Substrate/Competitorn/a
Meas. Tech.In-vitro HDAC Enzymatic Endpoint Assay
pH7.4±n/a
Temperature298.15±n/a K
Ki 29±n/a nM
IC50 64± 22 nM
Commentsextracted
Citation Wagner, FFLundh, MKaya, TMcCarren, PZhang, YLChattopadhyay, SGale, JPGalbo, TFisher, SLMeier, BCVetere, ARichardson, SMorgan, NGChristensen, DPGilbert, TJHooker, JMLeroy, MWalpita, DMandrup-Poulsen, TWagner, BKHolson, EB An Isochemogenic Set of Inhibitors To Define the Therapeutic Potential of Histone Deacetylases in ß-Cell Protection. ACS Chem Biol11:363-74 (2016) 
 
Histone deacetylase 3
Name:Histone deacetylase 3
Type:Enzyme
Mol. Mass.:48829.55
Organism:Homo sapiens (Human)
Description:O15379
Residue:428
BDBM178100
NameBDBM178100
Synonyms:BRD3308 | US11377423, Cmpd 1
TypeSmall organic molecule
Emp. Form.C15H14FN3O2
Mol. Mass.287.289
SMILESCC(=O)Nc1ccc(cc1)C(=O)Nc1ccc(F)cc1N