Reaction Details
TargetHistone deacetylase 4
LigandBDBM178100
Substrate/Competitorn/a
Meas. Tech.In-vitro HDAC Enzymatic Endpoint Assay
pH7.4±n/a
Temperature298.15±n/a K
IC50>3.33e+4±n/a nM
Commentsextracted
Citation Wagner, FFLundh, MKaya, TMcCarren, PZhang, YLChattopadhyay, SGale, JPGalbo, TFisher, SLMeier, BCVetere, ARichardson, SMorgan, NGChristensen, DPGilbert, TJHooker, JMLeroy, MWalpita, DMandrup-Poulsen, TWagner, BKHolson, EB An Isochemogenic Set of Inhibitors To Define the Therapeutic Potential of Histone Deacetylases in ß-Cell Protection. ACS Chem Biol11:363-74 (2016) 
 
Histone deacetylase 4
Name:Histone deacetylase 4
Type:Enzyme
Mol. Mass.:119049.39
Organism:Homo sapiens (Human)
Description:P56524
Residue:1084
BDBM178100
NameBDBM178100
Synonyms:BRD3308 | US11377423, Cmpd 1
TypeSmall organic molecule
Emp. Form.C15H14FN3O2
Mol. Mass.287.289
SMILESCC(=O)Nc1ccc(cc1)C(=O)Nc1ccc(F)cc1N