Reaction Details
Target5-hydroxytryptamine receptor 2A
LigandBDBM180699
Substrate/Competitorn/a
Meas. Tech.Radioligand Binding Assay
Ki 1.809±n/a nM
Citation Gobbi, LJaeschke, GRoche, OSarmiento, RMSteward, L Dual modulators of 5HT2A and D3 receptors US Patent US8829029 Publication Date 9/9/2014
 
5-hydroxytryptamine receptor 2A
Name:5-hydroxytryptamine receptor 2A
Type:undefined
Mol. Mass.:52607.65
Organism:Homo sapiens (Human)
Description:P28223
Residue:471
BDBM180699
NameBDBM180699
Synonyms:US8829029, 3
TypeSmall organic molecule
Emp. Form.C24H34FN3O3
Mol. Mass.431.5435
SMILESCOCCC(=O)N[C@H]1CC[C@H](CCN2CCC(CC2)c2noc3cc(F)ccc23)CC1