Reaction Details
Target5-hydroxytryptamine receptor 2A
LigandBDBM180711
Substrate/Competitorn/a
Meas. Tech.Radioligand Binding Assay
Ki 2.483±n/a nM
Citation Gobbi, LJaeschke, GRoche, OSarmiento, RMSteward, L Dual modulators of 5HT2A and D3 receptors US Patent US8829029 Publication Date 9/9/2014
 
5-hydroxytryptamine receptor 2A
Name:5-hydroxytryptamine receptor 2A
Type:undefined
Mol. Mass.:52607.65
Organism:Homo sapiens (Human)
Description:P28223
Residue:471
BDBM180711
NameBDBM180711
Synonyms:US8829029, 11
TypeSmall organic molecule
Emp. Form.C31H39FN4O4S
Mol. Mass.582.729
SMILESFc1ccc2c(noc2c1)C1CCN(CC[C@H]2CC[C@@H](CC2)NC(=O)c2ccc(cc2)N2CCS(=O)(=O)CC2)CC1