Reaction Details
Target5-hydroxytryptamine receptor 2A
LigandBDBM180712
Substrate/Competitorn/a
Meas. Tech.Radioligand Binding Assay
Ki 2.459±n/a nM
Citation Gobbi, LJaeschke, GRoche, OSarmiento, RMSteward, L Dual modulators of 5HT2A and D3 receptors US Patent US8829029 Publication Date 9/9/2014
 
5-hydroxytryptamine receptor 2A
Name:5-hydroxytryptamine receptor 2A
Type:undefined
Mol. Mass.:52607.65
Organism:Homo sapiens (Human)
Description:P28223
Residue:471
BDBM180712
NameBDBM180712
Synonyms:US8829029, 12
TypeSmall organic molecule
Emp. Form.C30H38FN5O3
Mol. Mass.535.6528
SMILESFc1ccc2c(noc2c1)C1CCN(CC[C@H]2CC[C@@H](CC2)NC(=O)c2ccnc(c2)N2CCOCC2)CC1