Reaction Details
Target5-hydroxytryptamine receptor 2A
LigandBDBM180714
Substrate/Competitorn/a
Meas. Tech.Radioligand Binding Assay
Ki 2.598±n/a nM
Citation Gobbi, LJaeschke, GRoche, OSarmiento, RMSteward, L Dual modulators of 5HT2A and D3 receptors US Patent US8829029 Publication Date 9/9/2014
 
5-hydroxytryptamine receptor 2A
Name:5-hydroxytryptamine receptor 2A
Type:undefined
Mol. Mass.:52607.65
Organism:Homo sapiens (Human)
Description:P28223
Residue:471
BDBM180714
NameBDBM180714
Synonyms:US8829029, 14
TypeSmall organic molecule
Emp. Form.C32H41FN4O2
Mol. Mass.532.6919
SMILESFc1ccc2c(noc2c1)C1CCN(CC[C@H]2CC[C@@H](CC2)NC(=O)c2ccc(cc2)N2CCCCC2)CC1