Reaction Details
TargetD(3) dopamine receptor
LigandBDBM180724
Substrate/Competitorn/a
Meas. Tech.Radioligand Binding Assay
Ki 2.438±n/a nM
Citation Gobbi, LJaeschke, GRoche, OSarmiento, RMSteward, L Dual modulators of 5HT2A and D3 receptors US Patent US8829029 Publication Date 9/9/2014
 
D(3) dopamine receptor
Name:D(3) dopamine receptor
Type:n/a
Mol. Mass.:44243.43
Organism:Homo sapiens (Human)
Description:n/a
Residue:400
BDBM180724
NameBDBM180724
Synonyms:US8829029, 24
TypeSmall organic molecule
Emp. Form.C22H30FN3O2
Mol. Mass.387.4909
SMILESCC(=O)N[C@H]1CC[C@H](CCN2CCC(CC2)c2noc3ccc(F)cc23)CC1