Reaction Details
TargetMacrophage colony-stimulating factor 1 receptor [538-972]
LigandBDBM181037
Substrate/Competitorn/a
Meas. Tech.Enzymatic Assay
pH7.5±n/a
Temperature303.15±n/a K
IC50 8±n/a nM
Commentsextracted
Citation Flynn, DLKaufman, MDSamarakoon, TCaldwell, TMVogeti, LAhn, YPatt, WCYates, KM Imidazolidinones and analogs exhibiting anti-cancer and anti-proliferative activities US Patent US9133183 Publication Date 9/15/2015
 
Macrophage colony-stimulating factor 1 receptor [538-972]
Name:Macrophage colony-stimulating factor 1 receptor [538-972]
Type:Other Protein Type
Mol. Mass.:48843.65
Organism:Homo sapiens (Human)
Description:Recombinant protein contains the full-length FMS cytoplasmic domain (FMS538-972.6His).
Residue:435
BDBM181037
NameBDBM181037
Synonyms:US9133183, Example 42
TypeSmall organic molecule
Emp. Form.C21H23N7O3
Mol. Mass.421.4524
SMILESCCN1CCN(C(=O)Nc2ccc(Oc3ccnc(c3)-c3cnn(C)c3)c(C)n2)C1=O