Reaction Details
TargetHepatocyte growth factor receptor
LigandBDBM181020
Substrate/Competitorn/a
Meas. Tech.In Vitro Receptor Tyrosine Kinase Assay
Temperature300.15±n/a K
IC50 898±n/a nM
Commentsextracted
Citation Flynn, DLKaufman, MDSamarakoon, TCaldwell, TMVogeti, LAhn, YPatt, WCYates, KM Imidazolidinones and analogs exhibiting anti-cancer and anti-proliferative activities US Patent US9133183 Publication Date 9/15/2015
 
Hepatocyte growth factor receptor
Name:Hepatocyte growth factor receptor
Type:Protein
Mol. Mass.:155559.73
Organism:Homo sapiens (Human)
Description:P08581
Residue:1390
BDBM181020
NameBDBM181020
Synonyms:US9133183, Example 29
TypeSmall organic molecule
Emp. Form.C24H27N7O3
Mol. Mass.461.5163
SMILESCc1nc(NC(=O)N2CCN(C3CCCC3)C2=O)ccc1Oc1ccnc(c1)-c1cnn(C)c1