Reaction Details
TargetVascular endothelial growth factor receptor 2
LigandBDBM181023
Substrate/Competitorn/a
Meas. Tech.In Vitro Receptor Tyrosine Kinase Assay
Temperature300.15±n/a K
IC50 990±n/a nM
Commentsextracted
Citation Flynn, DLKaufman, MDSamarakoon, TCaldwell, TMVogeti, LAhn, YPatt, WCYates, KM Imidazolidinones and analogs exhibiting anti-cancer and anti-proliferative activities US Patent US9133183 Publication Date 9/15/2015
 
Vascular endothelial growth factor receptor 2
Name:Vascular endothelial growth factor receptor 2
Type:Receptor Tyrosine Kinase
Mol. Mass.:151510.97
Organism:Homo sapiens (Human)
Description:P35968
Residue:1356
BDBM181023
NameBDBM181023
Synonyms:US9133183, Compound A
TypeSmall organic molecule
Emp. Form.C24H20FN7O3
Mol. Mass.473.4591
SMILESCn1cc(cn1)-c1cc(Oc2ccc(NC(=O)N3CCN(C3=O)c3ccc(F)cc3)nc2)ccn1