Reaction Details
TargetVascular endothelial growth factor receptor 2
LigandBDBM181026
Substrate/Competitorn/a
Meas. Tech.In Vitro Receptor Tyrosine Kinase Assay
Temperature300.15±n/a K
IC50>3300±n/a nM
Commentsextracted
Citation Flynn, DLKaufman, MDSamarakoon, TCaldwell, TMVogeti, LAhn, YPatt, WCYates, KM Imidazolidinones and analogs exhibiting anti-cancer and anti-proliferative activities US Patent US9133183 Publication Date 9/15/2015
 
Vascular endothelial growth factor receptor 2
Name:Vascular endothelial growth factor receptor 2
Type:Receptor Tyrosine Kinase
Mol. Mass.:151510.97
Organism:Homo sapiens (Human)
Description:P35968
Residue:1356
BDBM181026
NameBDBM181026
Synonyms:US9133183, Example 18
TypeSmall organic molecule
Emp. Form.C22H25N7O4
Mol. Mass.451.4784
SMILESCOCCN1CCN(C(=O)Nc2ccc(Oc3ccnc(c3)-c3cnn(C)c3)c(C)n2)C1=O