Reaction Details
TargetVascular endothelial growth factor receptor 2
LigandBDBM181027
Substrate/Competitorn/a
Meas. Tech.In Vitro Receptor Tyrosine Kinase Assay
Temperature300.15±n/a K
IC50 3300±n/a nM
Commentsextracted
Citation Flynn, DLKaufman, MDSamarakoon, TCaldwell, TMVogeti, LAhn, YPatt, WCYates, KM Imidazolidinones and analogs exhibiting anti-cancer and anti-proliferative activities US Patent US9133183 Publication Date 9/15/2015
 
Vascular endothelial growth factor receptor 2
Name:Vascular endothelial growth factor receptor 2
Type:Receptor Tyrosine Kinase
Mol. Mass.:151510.97
Organism:Homo sapiens (Human)
Description:P35968
Residue:1356
BDBM181027
NameBDBM181027
Synonyms:US9133183, Example 90
TypeSmall organic molecule
Emp. Form.C20H24N6O4
Mol. Mass.412.4424
SMILESCNC(=O)c1cc(Oc2ccc(NC(=O)N3CCN(C3=O)C(C)(C)C)nc2)ccn1