Reaction Details
Target(S)-6-hydroxynicotine oxidase
LigandBDBM181053
Substrate/Competitorn/a
Meas. Tech.Steady-State Kinetics
pH8±n/a
Kd 1.00e+5± 5.0e+4 nM
Commentsextracted
Citation Fitzpatrick, PFChadegani, FZhang, SRoberts, KMHinck, CS Mechanism of the Flavoprotein l-Hydroxynicotine Oxidase: Kinetic Mechanism, Substrate Specificity, Reaction Product, and Roles of Active-Site Residues. Biochemistry55:697-703 (2016) 
 
(S)-6-hydroxynicotine oxidase
Name:(S)-6-hydroxynicotine oxidase
Synonyms:L‐Hydroxynicotine oxidase (LHNO)
Type:Protein
Mol. Mass.:46260.18
Organism:Arthrobacter nicotinovorans
Description:O86101
Residue:425
BDBM181053
NameBDBM181053
Synonyms:(S)-6-hydroxynicotine
TypeSmall organic molecule
Emp. Form.C10H15N2O
Mol. Mass.179.2384
SMILESC[NH+]1CCC[C@H]1c1ccc(=O)[nH]c1