Reaction Details
TargetMAP kinase-interacting serine/threonine-protein kinase 2
LigandBDBM181385
Substrate/Competitorn/a
Meas. Tech.In vitro Kinase Assay
IC50 1±n/a nM
Citation Blum, AGottschling, DHeckel, AHehn, JPSchmid, BWiedenmayer, D Sulfoximine substituted quinazolines for pharmaceutical compositions US Patent US9139577 Publication Date 9/22/2015
 
MAP kinase-interacting serine/threonine-protein kinase 2
Name:MAP kinase-interacting serine/threonine-protein kinase 2
Type:Protein
Mol. Mass.:51870.79
Organism:Homo sapiens (Human)
Description:Q9HBH9
Residue:465
BDBM181385
NameBDBM181385
Synonyms:US9139577, 1.016 | US9708274, 1.016
TypeSmall organic molecule
Emp. Form.C21H21ClN6O3S
Mol. Mass.472.948
SMILESC[C@@H](Oc1ncccc1Nc1ncnc2cc(cc(Cl)c12)N=S(C)(C)=O)c1cc(C)no1