Reaction Details
TargetMAP kinase-interacting serine/threonine-protein kinase 2
LigandBDBM181423
Substrate/Competitorn/a
Meas. Tech.In vitro Kinase Assay
IC50 1±n/a nM
Citation Blum, AGottschling, DHeckel, AHehn, JPSchmid, BWiedenmayer, D Sulfoximine substituted quinazolines for pharmaceutical compositions US Patent US9139577 Publication Date 9/22/2015
 
MAP kinase-interacting serine/threonine-protein kinase 2
Name:MAP kinase-interacting serine/threonine-protein kinase 2
Type:Protein
Mol. Mass.:51870.79
Organism:Homo sapiens (Human)
Description:Q9HBH9
Residue:465
BDBM181423
NameBDBM181423
Synonyms:US9139577, 2.032 | US9708274, 2.032
TypeSmall organic molecule
Emp. Form.C27H28F4N6O5S
Mol. Mass.624.607
SMILESCOC(=O)N1CC2(C1)CS(=O)(C2)=Nc1cc(C)c2c(Nc3ccc(F)cc3O[C@H](C)C(=O)NCC(F)(F)F)ncnc2c1