Reaction Details
TargetMAP kinase-interacting serine/threonine-protein kinase 2
LigandBDBM181587
Substrate/Competitorn/a
Meas. Tech.In vitro Kinase Assay
IC50 1±n/a nM
Citation Blum, AGottschling, DHeckel, AHehn, JPSchmid, BWiedenmayer, D Sulfoximine substituted quinazolines for pharmaceutical compositions US Patent US9139577 Publication Date 9/22/2015
 
MAP kinase-interacting serine/threonine-protein kinase 2
Name:MAP kinase-interacting serine/threonine-protein kinase 2
Type:Protein
Mol. Mass.:51870.79
Organism:Homo sapiens (Human)
Description:Q9HBH9
Residue:465
BDBM181587
NameBDBM181587
Synonyms:US9139577, 4.093 | US9708274, 4.093
TypeSmall organic molecule
Emp. Form.C24H24ClFN6O3S
Mol. Mass.531.002
SMILESC[C@H](NC(=O)[C@@H](C)Oc1cc(Cl)ccc1Nc1ncnc2cc(cc(F)c12)N=S1(=O)CCCC1)C#N