Reaction Details
TargetATP-sensitive inward rectifier potassium channel 1
LigandBDBM181721
Substrate/Competitorn/a
Meas. Tech.Electrophysiology Assay
pH7.4±n/a
Temperature310.15±n/a K
IC50 54±n/a nM
Commentsextracted
Citation Walsh, SPPasternak, ADeJesus, RKTang, HPio, BShahripour, ABelyk, KMChobanian, HRGuo, YFrie, JLShi, ZChen, HBlizzard, TACato, B Inhibitors of the Renal Outer Medullary Potassium channel US Patent US9139585 Publication Date 9/22/2015
 
ATP-sensitive inward rectifier potassium channel 1
Name:ATP-sensitive inward rectifier potassium channel 1
Type:Enzyme Catalytic Domain
Mol. Mass.:44809.08
Organism:Homo sapiens (Human)
Description:gi_223460826
Residue:391
BDBM181721
NameBDBM181721
Synonyms:US9139585, 16
TypeSmall organic molecule
Emp. Form.C24H26N6O5S
Mol. Mass.510.565
SMILESCc1c2COC(=O)c2ccc1[C@@H](O)CN1C[C@@H]2CC[C@H](C1)N2S(=O)(=O)c1ccc(cc1)-n1cnnn1